{"text_format":"1","workbook":"xlsx","n_sheets":8,"sheets":["Welcome","Staff ","Delay","Trunks","SL & Occ Bar","Instructions","Example","Module1"],"not_rendered":{"charts":1,"images":2,"macros":1,"external_links":1,"defined_names":3,"comments":0,"pivot_tables":0},"unopened":[{"sheet":"Module1","index":7,"reason":"part_missing"}],"bounds":{"document_bytes":16777216,"sheet_cells":100000,"rows_first":2000,"rows_last":500,"rows_between":2000,"halvings":0,"cell_chars":16384,"cell_head_chars":4096},"cells_cut":0,"cells_raw":0,"read":"whole","date_system":"1900"}

{"sheet":"Welcome","index":0,"n_rows":5,"n_cols":2,"rows_kept":5,"cut":false,"hidden":false,"merged":[]}
[]
[null,"Customer Queue Calculator"]
[null,"© Brad Cleveland"]
[null,"Sponsored by: International Customer Management Institute (ICMI)"]
[null,"Version 1.2, July 22, 2022"]

{"sheet":"Staff ","index":1,"n_rows":81,"n_cols":10,"rows_kept":81,"cut":false,"hidden":false,"merged":[]}
[]
[null,"Customer Queue Calculator"]
[null,"© Brad Cleveland"]
[null,"Sponsored by: International Customer Management Institute (ICMI)"]
[]
[null,null,null,null,null,null,null,null,null,"*Measured in seconds"]
[null,null,null,"Average Talk Time*",180,null,null,null,"Average After Contact Work Time*",30]
[null,null,null,"Contacts Per Half Hour",250,null,null,null,"Service Level Objective*",20]
[]
[null,"Agents","Probablity of call queueing P(0)","Average Speed of Answer (ASA)*","Avg. Wait if Wait* (DLYDLY)","Average Queue Size (Q1)","Average Queue Size if Queue (Q2)","Service Level (SL)","Agent Occupancy (OCC)","Trunkload (TKLD)"]
[null,{"$f":"ROUNDUP((E7+J7)*E8*2/3600,0)","v":30},{"$f":"IF(B11=\"\",\"\",IF(Queued(B11,$E$8*2,$E$7+$J$7)=1,\"        Insufficient\",Queued(B11,$E$8*2,$E$7+$J$7)))","v":0.82798713445663452},{"$f":"IF(B11=\"\",\"\",IF(C11=\"        Insufficient\",\"Staffing     \",ASA(B11,$E$8*2,$E$7+$J$7)))","v":209},{"$f":"IF(B11=\"\",\"\",IF(C11=\"        Insufficient\",\"\",($D11*$E$8)/($C11*$E$8)))","v":252.41938105373578},{"$f":"IF(B11=\"\",\"\",IF(C11=\"        Insufficient\",\"\",QueueSize($B11,$E$8*2,($E$7+$J$7))))","v":29},{"$f":"IF(B11=\"\",\"\",IF(C11=\"        Insufficient\",\"\",IF(F11/C11>G10,G10,F11/C11)))","v":35.024698806499224},{"$f":"IF(B11=\"\",\"\",IF(C11=\"        Insufficient\",\"\",SLA(B11,$J$8,$E$8*2,$E$7+$J$7)))","v":0.23518601059913635},{"$f":"IF(B11=\"\",\"\",IF(C11=\"        Insufficient\",\"\",Utilisation(B11,$E$8*2,$E$7+$J$7)))","v":0.97222226858139038},{"$f":"IF(B11=\"\",\"\",IF(C11=\"        Insufficient\",\"\",($D11+$E$7)*$E$8/1800))","v":54.027777777777779}]
[null,{"$f":"B11+1","v":31},{"$f":"IF(B12=\"\",\"\",Queued(B12,$E$8*2,$E$7+$J$7))","v":0.65233182907104492},{"$f":"IF(B12=\"\",\"\",ASA(B12,$E$8*2,$E$7+$J$7))","v":75},{"$f":"IF(B12=\"\",\"\",IF(E11<1,0,IF(($D12*$E$8)/($C12*$E$8)>E11,E11-1,($D12*$E$8)/($C12*$E$8))))","v":114.97216088137839},{"$f":"IF(B12=\"\",\"\",IF(QueueSize($B12,$E$8*2,($E$7+$J$7))>F11,F11,QueueSize($B12,$E$8*2,($E$7+$J$7))))","v":10},{"$f":"IF(B12=\"\",\"\",IF(F12/C12>G11,G11,F12/C12))","v":15.329621450850452},{"$f":"IF(B12=\"\",\"\",SLA(B12,$J$8,$E$8*2,$E$7+$J$7))","v":0.45217806100845337},{"$f":"IF(B12=\"\",\"\",Utilisation(B12,$E$8*2,$E$7+$J$7))","v":0.94086027145385742},{"$f":"IF(B12=\"\",\"\",($D12+$E$7)*$E$8/1800)","v":35.416666666666664}]
[null,{"$f":"IF(H12=\"\",\"\",IF(H12<99.5%,B12+1,\"\"))","v":32},{"$f":"IF(B13=\"\",\"\",Queued(B13,$E$8*2,$E$7+$J$7))","v":0.50694894790649414},{"$f":"IF(B13=\"\",\"\",ASA(B13,$E$8*2,$E$7+$J$7))","v":38},74.958238214963288,{"$f":"IF(B13=\"\",\"\",IF(QueueSize($B13,$E$8*2,($E$7+$J$7))>F12,F12,QueueSize($B13,$E$8*2,($E$7+$J$7))))","v":5},9.8629260809162211,{"$f":"IF(B13=\"\",\"\",SLA(B13,$J$8,$E$8*2,$E$7+$J$7))","v":0.61294406652450562},{"$f":"IF(B13=\"\",\"\",Utilisation(B13,$E$8*2,$E$7+$J$7))","v":0.91145837306976318},{"$f":"IF(B13=\"\",\"\",($D13+$E$7)*$E$8/1800)","v":30.277777777777779}]
[null,{"$f":"IF(H13=\"\",\"\",IF(H13<99.5%,B13+1,\"\"))","v":33},{"$f":"IF(B14=\"\",\"\",Queued(B14,$E$8*2,$E$7+$J$7))","v":0.38833373785018921},{"$f":"IF(B14=\"\",\"\",ASA(B14,$E$8*2,$E$7+$J$7))","v":21},54.077196888057529,{"$f":"IF(B14=\"\",\"\",IF(QueueSize($B14,$E$8*2,($E$7+$J$7))>F13,F13,QueueSize($B14,$E$8*2,($E$7+$J$7))))","v":3},7.7253138411510758,{"$f":"IF(B14=\"\",\"\",SLA(B14,$J$8,$E$8*2,$E$7+$J$7))","v":0.7304413914680481},{"$f":"IF(B14=\"\",\"\",Utilisation(B14,$E$8*2,$E$7+$J$7))","v":0.88383841514587402},{"$f":"IF(B14=\"\",\"\",($D14+$E$7)*$E$8*2/3600)","v":27.916666666666668}]
[null,34,{"$f":"IF(B15=\"\",\"\",Queued(B15,$E$8*2,$E$7+$J$7))","v":0.29302027821540833},{"$f":"IF(B15=\"\",\"\",ASA(B15,$E$8*2,$E$7+$J$7))","v":13},44.365530191884176,{"$f":"IF(B15=\"\",\"\",IF(QueueSize($B15,$E$8*2,($E$7+$J$7))>F14,F14,QueueSize($B15,$E$8*2,($E$7+$J$7))))","v":2},6.8254661833667969,{"$f":"IF(B15=\"\",\"\",SLA(B15,$J$8,$E$8*2,$E$7+$J$7))","v":0.81507980823516846},{"$f":"IF(B15=\"\",\"\",Utilisation(B15,$E$8*2,$E$7+$J$7))","v":0.85784316062927246},26.805555555555557]
{"$rows_left_out":67}
{"sheet":"Delay","index":2,"n_rows":83,"n_cols":21,"rows_kept":83,"cut":false,"hidden":false,"merged":[[9,1,11,1],[9,2,11,2],[9,15,9,20],[9,3,9,11]]}
[]
[null,"Customer Queue Calculator"]
[null,"© Brad Cleveland"]
[null,"Sponsored by: International Customer Management Institute (ICMI)"]
[]
[null,null,null,null,null,null,null,null,null,"     (Make entries on staff tab)"]
[null,null,null,{"$f":"'Staff '!D7","v":"Average Talk Time*"},{"$f":"'Staff '!E7","v":180},null,null,null,{"$f":"'Staff '!I7","v":"Average After Contact Work Time*"},{"$f":"'Staff '!J7","v":30}]
[null,null,null,{"$f":"'Staff '!D8","v":"Contacts Per Half Hour"},{"$f":"'Staff '!CPH","v":250},null,null,null,{"$f":"'Staff '!I8","v":"Service Level Objective*"},{"$f":"'Staff '!J8","v":20}]
[null,null,null,null,null,null,null,null,null,null,null,null,null,null,null,null,null,null,null,null,"*Measured in seconds"]
[null,"Agents","SL %","Number of customers waiting longer than x seconds"]
[null,null,null,null,null,null,null,null,null,null,null,null,"2 mins.","3 mins.","4 mins.","5 mins.","6 mins.","7 mins.","8 mins.","9 mins.","10 mins."]
[null,null,null,5,10,15,20,30,40,50,60,90,120,180,240,300,360,420,480,540,600]
[null,{"$f":"'Staff '!B11","v":30},{"$f":"IF('Staff '!H11=\"\",\"    Insufficient\",SLA($B13,$J$8,$E$8*2,$E$7+$J$7))","v":0.23518601059913635},{"$f":"IF($B13=\"\",\"\",IF('Staff '!C11=\"        Insufficient\",\"Staffing  \",$E$8-SLA($B13,D$12,$E$8*2,$E$7+$J$7)*($E$8)))","v":202.93018594384193},{"$f":"IF('Staff '!H11=\"\",\"\",IF('Staff '!D11=\"Insufficient\",\"Staffing\",$E$8-SLA($B13,E$12,$E$8*2,$E$7+$J$7)*($E$8)))","v":198.94348084926605},{"$f":"IF(E13=\"\",\"\",IF('Staff '!E11=\"Insufficient\",\"Staffing\",$E$8-SLA($B13,F$12,$E$8*2,$E$7+$J$7)*($E$8)))","v":195.03509998321533},{"$f":"IF(F13=\"\",\"\",IF('Staff '!F11=\"Insufficient\",\"Staffing\",$E$8-SLA($B13,G$12,$E$8*2,$E$7+$J$7)*($E$8)))","v":191.20349735021591},{"$f":"IF(G13=\"\",\"\",IF('Staff '!G11=\"Insufficient\",\"Staffing\",$E$8-SLA($B13,H$12,$E$8*2,$E$7+$J$7)*($E$8)))","v":183.76464396715164},{"$f":"IF(H13=\"\",\"\",IF('Staff '!H11=\"Insufficient\",\"Staffing\",$E$8-SLA($B13,I$12,$E$8*2,$E$7+$J$7)*($E$8)))","v":176.61519348621368},{"$f":"IF(I13=\"\",\"\",IF('Staff '!I11=\"Insufficient\",\"Staffing\",$E$8-SLA($B13,J$12,$E$8*2,$E$7+$J$7)*($E$8)))","v":169.74390298128128},{"$f":"IF(J13=\"\",\"\",IF('Staff '!J11=\"Insufficient\",\"Staffing\",$E$8-SLA($B13,K$12,$E$8*2,$E$7+$J$7)*($E$8)))","v":163.1399467587471},{"$f":"IF(K13=\"\",\"\",IF('Staff '!K11=\"Insufficient\",\"Staffing\",$E$8-SLA($B13,L$12,$E$8*2,$E$7+$J$7)*($E$8)))","v":144.83004063367844},{"$f":"IF(L13=\"\",\"\",IF('Staff '!L11=\"Insufficient\",\"Staffing\",$E$8-SLA($B13,M$12,$E$8*2,$E$7+$J$7)*($E$8)))","v":128.57514619827271},{"$f":"IF(M13=\"\",\"\",IF('Staff '!M11=\"Insufficient\",\"Staffing\",$E$8-SLA($B13,N$12,$E$8*2,$E$7+$J$7)*($E$8)))","v":101.33366286754608},{"$f":"IF(N13=\"\",\"\",IF('Staff '!N11=\"Insufficient\",\"Staffing\",$E$8-SLA($B13,O$12,$E$8*2,$E$7+$J$7)*($E$8)))","v":79.863891005516052},{"$f":"IF(O13=\"\",\"\",IF('Staff '!O11=\"Insufficient\",\"Staffing\",$E$8-SLA($B13,P$12,$E$8*2,$E$7+$J$7)*($E$8)))","v":62.942951917648315},{"$f":"IF(P13=\"\",\"\",IF('Staff '!P11=\"Insufficient\",\"Staffing\",$E$8-SLA($B13,Q$12,$E$8*2,$E$7+$J$7)*($E$8)))","v":49.60709810256958},{"$f":"IF(Q13=\"\",\"\",IF('Staff '!Q11=\"Insufficient\",\"Staffing\",$E$8-SLA($B13,R$12,$E$8*2,$E$7+$J$7)*($E$8)))","v":39.096742868423462},{"$f":"IF(R13=\"\",\"\",IF('Staff '!R11=\"Insufficient\",\"Staffing\",$E$8-SLA($B13,S$12,$E$8*2,$E$7+$J$7)*($E$8)))","v":30.813232064247131},{"$f":"IF(S13=\"\",\"\",IF('Staff '!S11=\"Insufficient\",\"Staffing\",$E$8-SLA($B13,T$12,$E$8*2,$E$7+$J$7)*($E$8)))","v":24.284765124320984},{"$f":"IF(T13=\"\",\"\",IF('Staff '!T11=\"Insufficient\",\"Staffing\",$E$8-SLA($B13,U$12,$E$8*2,$E$7+$J$7)*($E$8)))","v":19.139498472213745}]
[null,{"$f":"'Staff '!B12","v":31},{"$f":"IF('Staff '!H12=\"\",\"\",SLA($B14,$J$8,$E$8*2,$E$7+$J$7))","v":0.45217806100845337},{"$f":"IF($B14=\"\",\"\",IF('Staff '!C12=\"Insufficient\",\"Staffing\",$E$8-SLA($B14,D$12,$E$8*2,$E$7+$J$7)*($E$8)))","v":156.11739456653595},{"$f":"IF('Staff '!H12=\"\",\"\",IF('Staff '!D12=\"Insufficient\",\"Staffing\",$E$8-SLA($B14,E$12,$E$8*2,$E$7+$J$7)*($E$8)))","v":149.44934099912643},{"$f":"IF(E14=\"\",\"\",IF('Staff '!E12=\"Insufficient\",\"Staffing\",$E$8-SLA($B14,F$12,$E$8*2,$E$7+$J$7)*($E$8)))","v":143.06609332561493},{"$f":"IF(F14=\"\",\"\",IF('Staff '!F12=\"Insufficient\",\"Staffing\",$E$8-SLA($B14,G$12,$E$8*2,$E$7+$J$7)*($E$8)))","v":136.95548474788666},{"$f":"IF(G14=\"\",\"\",IF('Staff '!G12=\"Insufficient\",\"Staffing\",$E$8-SLA($B14,H$12,$E$8*2,$E$7+$J$7)*($E$8)))","v":125.50611048936844},{"$f":"IF(H14=\"\",\"\",IF('Staff '!H12=\"Insufficient\",\"Staffing\",$E$8-SLA($B14,I$12,$E$8*2,$E$7+$J$7)*($E$8)))","v":115.01389741897583},{"$f":"IF(I14=\"\",\"\",IF('Staff '!I12=\"Insufficient\",\"Staffing\",$E$8-SLA($B14,J$12,$E$8*2,$E$7+$J$7)*($E$8)))","v":105.39881885051727},{"$f":"IF(J14=\"\",\"\",IF('Staff '!J12=\"Insufficient\",\"Staffing\",$E$8-SLA($B14,K$12,$E$8*2,$E$7+$J$7)*($E$8)))","v":96.58755362033844},{"$f":"IF(K14=\"\",\"\",IF('Staff '!K12=\"Insufficient\",\"Staffing\",$E$8-SLA($B14,L$12,$E$8*2,$E$7+$J$7)*($E$8)))","v":74.332281947135925},{"$f":"IF(L14=\"\",\"\",IF('Staff '!L12=\"Insufficient\",\"Staffing\",$E$8-SLA($B14,M$12,$E$8*2,$E$7+$J$7)*($E$8)))","v":57.204961776733398},{"$f":"IF(M14=\"\",\"\",IF('Staff '!M12=\"Insufficient\",\"Staffing\",$E$8-SLA($B14,N$12,$E$8*2,$E$7+$J$7)*($E$8)))","v":33.880218863487244},{"$f":"IF(N14=\"\",\"\",IF('Staff '!N12=\"Insufficient\",\"Staffing\",$E$8-SLA($B14,O$12,$E$8*2,$E$7+$J$7)*($E$8)))","v":20.065903663635254},{"$f":"IF(O14=\"\",\"\",IF('Staff '!O12=\"Insufficient\",\"Staffing\",$E$8-SLA($B14,P$12,$E$8*2,$E$7+$J$7)*($E$8)))","v":11.884242296218872},{"$f":"IF(P14=\"\",\"\",IF('Staff '!P12=\"Insufficient\",\"Staffing\",$E$8-SLA($B14,Q$12,$E$8*2,$E$7+$J$7)*($E$8)))","v":7.0385634899139404},{"$f":"IF(Q14=\"\",\"\",IF('Staff '!Q12=\"Insufficient\",\"Staffing\",$E$8-SLA($B14,R$12,$E$8*2,$E$7+$J$7)*($E$8)))","v":4.1686594486236572},{"$f":"IF(R14=\"\",\"\",IF('Staff '!R12=\"Insufficient\",\"Staffing\",$E$8-SLA($B14,S$12,$E$8*2,$E$7+$J$7)*($E$8)))","v":2.4689286947250366},{"$f":"IF(S14=\"\",\"\",IF('Staff '!S12=\"Insufficient\",\"Staffing\",$E$8-SLA($B14,T$12,$E$8*2,$E$7+$J$7)*($E$8)))","v":1.4622509479522705},{"$f":"IF(T14=\"\",\"\",IF('Staff '!T12=\"Insufficient\",\"Staffing\",$E$8-SLA($B14,U$12,$E$8*2,$E$7+$J$7)*($E$8)))","v":0.86602568626403809}]
[null,{"$f":"'Staff '!B13","v":32},{"$f":"IF('Staff '!H13=\"\",\"\",SLA($B15,$J$8,$E$8*2,$E$7+$J$7))","v":0.61294406652450562},{"$f":"IF($B15=\"\",\"\",IF('Staff '!C13=\"Insufficient\",\"Staffing\",$E$8-SLA($B15,D$12,$E$8*2,$E$7+$J$7)*($E$8)))","v":118.46950650215149},{"$f":"IF('Staff '!H13=\"\",\"\",IF('Staff '!D13=\"Insufficient\",\"Staffing\",$E$8-SLA($B15,E$12,$E$8*2,$E$7+$J$7)*($E$8)))","v":110.74113845825195},{"$f":"IF(E15=\"\",\"\",IF('Staff '!E13=\"Insufficient\",\"Staffing\",$E$8-SLA($B15,F$12,$E$8*2,$E$7+$J$7)*($E$8)))","v":103.51692140102386},{"$f":"IF(F15=\"\",\"\",IF('Staff '!F13=\"Insufficient\",\"Staffing\",$E$8-SLA($B15,G$12,$E$8*2,$E$7+$J$7)*($E$8)))","v":96.763983368873596},{"$f":"IF(G15=\"\",\"\",IF('Staff '!G13=\"Insufficient\",\"Staffing\",$E$8-SLA($B15,H$12,$E$8*2,$E$7+$J$7)*($E$8)))","v":84.550946950912476},{"$f":"IF(H15=\"\",\"\",IF('Staff '!H13=\"Insufficient\",\"Staffing\",$E$8-SLA($B15,I$12,$E$8*2,$E$7+$J$7)*($E$8)))","v":73.87937605381012},{"$f":"IF(I15=\"\",\"\",IF('Staff '!I13=\"Insufficient\",\"Staffing\",$E$8-SLA($B15,J$12,$E$8*2,$E$7+$J$7)*($E$8)))","v":64.554706215858459},{"$f":"IF(J15=\"\",\"\",IF('Staff '!J13=\"Insufficient\",\"Staffing\",$E$8-SLA($B15,K$12,$E$8*2,$E$7+$J$7)*($E$8)))","v":56.406959891319275},{"$f":"IF(K15=\"\",\"\",IF('Staff '!K13=\"Insufficient\",\"Staffing\",$E$8-SLA($B15,L$12,$E$8*2,$E$7+$J$7)*($E$8)))","v":37.631094455718994},{"$f":"IF(L15=\"\",\"\",IF('Staff '!L13=\"Insufficient\",\"Staffing\",$E$8-SLA($B15,M$12,$E$8*2,$E$7+$J$7)*($E$8)))","v":25.10504424571991},{"$f":"IF(M15=\"\",\"\",IF('Staff '!M13=\"Insufficient\",\"Staffing\",$E$8-SLA($B15,N$12,$E$8*2,$E$7+$J$7)*($E$8)))","v":11.17350161075592},{"$f":"IF(N15=\"\",\"\",IF('Staff '!N13=\"Insufficient\",\"Staffing\",$E$8-SLA($B15,O$12,$E$8*2,$E$7+$J$7)*($E$8)))","v":4.972994327545166},{"$f":"IF(O15=\"\",\"\",IF('Staff '!O13=\"Insufficient\",\"Staffing\",$E$8-SLA($B15,P$12,$E$8*2,$E$7+$J$7)*($E$8)))","v":2.2133290767669678},{"$f":"IF(P15=\"\",\"\",IF('Staff '!P13=\"Insufficient\",\"Staffing\",$E$8-SLA($B15,Q$12,$E$8*2,$E$7+$J$7)*($E$8)))","v":0.98508596420288086},{"$f":"IF(Q15=\"\",\"\",IF('Staff '!Q13=\"Insufficient\",\"Staffing\",$E$8-SLA($B15,R$12,$E$8*2,$E$7+$J$7)*($E$8)))","v":0.43843686580657959},{"$f":"IF(R15=\"\",\"\",IF('Staff '!R13=\"Insufficient\",\"Staffing\",$E$8-SLA($B15,S$12,$E$8*2,$E$7+$J$7)*($E$8)))","v":0.19513070583343506},{"$f":"IF(S15=\"\",\"\",IF('Staff '!S13=\"Insufficient\",\"Staffing\",$E$8-SLA($B15,T$12,$E$8*2,$E$7+$J$7)*($E$8)))","v":8.6843967437744141E-2},{"$f":"IF(T15=\"\",\"\",IF('Staff '!T13=\"Insufficient\",\"Staffing\",$E$8-SLA($B15,U$12,$E$8*2,$E$7+$J$7)*($E$8)))","v":3.865361213684082E-2}]
{"$rows_left_out":69}
{"sheet":"Trunks","index":3,"n_rows":20,"n_cols":10,"rows_kept":20,"cut":false,"hidden":false,"merged":[[18,1,18,9]]}
[]
[null,"Customer Queue Calculator"]
[null,"© Brad Cleveland"]
[null,"Sponsored by: International Customer Management Institute (ICMI)"]
[]
[null,null,"For each trunk group, enter the Erlangs (hours) of traffic and the % blockage allowable*"]
[null,null,null,null,null,null,null,null,null,"Trunks required:"]
[null,null,"Erlangs of traffic for trunk group 1:",null,null,100,"% blockage:",1E-3,null,{"$f":"NBTrunks(F8,H8)","v":128}]
[]
[null,null,"Erlangs of traffic for trunk group 2:",null,null,100,"% blockage:",0.02,null,{"$f":"NBTrunks(F10,H10)","v":113}]
[]
[null,null,"Erlangs of traffic for trunk group 3:",null,null,100,"% blockage:",0.03,null,{"$f":"NBTrunks(F12,H12)","v":110}]
[]
[null,null,"Erlangs of traffic for trunk group 4:",null,null,null,"% blockage:",null,null,{"$f":"NBTrunks(F14,H14)","v":0}]
[]
{"$rows_left_out":6}
{"sheet":"SL & Occ Bar","index":4,"n_rows":9,"n_cols":11,"rows_kept":9,"cut":false,"hidden":false,"merged":[]}
[]
[null,"Customer Queue Calculator"]
[null,"© Brad Cleveland"]
[null,"Sponsored by: International Customer Management Institute (ICMI)"]
[]
[null,null,null,null,null,null,null,null,null,null,{"$f":"'Staff '!J6","v":"*Measured in seconds"}]
[]
[null,null,null,{"$f":"'Staff '!D7","v":"Average Talk Time*"},{"$f":"'Staff '!E7","v":180},null,null,null,{"$f":"'Staff '!I7","v":"Average After Contact Work Time*"},{"$f":"'Staff '!J7","v":30}]
[null,null,null,{"$f":"'Staff '!D8","v":"Contacts Per Half Hour"},{"$f":"'Staff '!E8","v":250},null,null,null,{"$f":"'Staff '!I8","v":"Service Level Objective*"},{"$f":"'Staff '!J8","v":20}]

{"sheet":"Instructions","index":5,"n_rows":146,"n_cols":2,"rows_kept":146,"cut":false,"hidden":false,"merged":[]}
[]
[null,"Customer Queue Calculator"]
[null,"© Brad Cleveland"]
[null,"Sponsored by: International Customer Management Institute (ICMI)"]
[]
[null,"Overview"]
[]
[null,"The Customer Queue Calculator is an easy-to-use tool that enables you to:"]
[]
[null,"·         Estimate base staff requirements for any half hour."]
[null,"·         Gain a wealth of related insight on customer delay times, employee occupancy (amount of time they are "]
[null,"          directly helping customers), and other variables."]
[null,"·         Predict the workload that will be carried by systems (if applicable)."]
[null,"·         Illustrate the “power of one”—the impact each employee has on customers and other employees."]
[]
{"$rows_left_out":132}
{"sheet":"Example","index":6,"n_rows":36,"n_cols":10,"rows_kept":36,"cut":false,"hidden":true,"merged":[]}
["© Brad Cleveland"]
["Sponsored by: International Customer Management Institute (ICMI)"]
["Version: Beta V 1.0, July 1, 2021"]
[]
[null,"SLA%","Service Time (sec)","Calls per Hour","AHT (secs)","MaxWait (secs)"]
["Enter parameters here -->",0.85,15,100,180,30]
[]
[null,"# Agents","# Trunks","SLA%","% Queued","Aband'd","Utilisation","ASA (secs)","Queue Time (secs)","Average Queue"]
[null,{"$f":"B10-1","v":6},{"$f":"Trunks(B9,$D$6,$E$6)","v":18},{"$f":"SLA(B9,$C$6,$D$6,$E$6)","v":0.45945873856544495},{"$f":"Queued(B9,$D$6,$E$6)","v":0.58751648664474487},{"$f":"Abandon(B9,$F$6,$D$6,$E$6)","v":0.4973219633102417},{"$f":"Utilisation(B9,$D$6,$E$6)","v":0.83333331346511841},{"$f":"ASA(B9,$D$6,$E$6)","v":106},{"$f":"QueueTime(B9,$D$6,$E$6)","v":180},{"$f":"QueueSize(B9,$D$6,$E$6)","v":3}]
[null,{"$f":"B11-1","v":7},15,{"$f":"SLA(B10,$C$6,$D$6,$E$6)","v":0.72561299800872803},{"$f":"Queued(B10,$D$6,$E$6)","v":0.3241499662399292},{"$f":"Abandon(B10,$F$6,$D$6,$E$6)","v":0.23226359486579895},{"$f":"Utilisation(B10,$D$6,$E$6)","v":0.71428573131561279},{"$f":"ASA(B10,$D$6,$E$6)","v":29},{"$f":"QueueTime(B10,$D$6,$E$6)","v":90},{"$f":"QueueSize(B10,$D$6,$E$6)","v":1}]
["Answers are given here -->",{"$f":"Agents(B6,C6,D6,E6)","v":8},{"$f":"Trunks(B11,$D$6,$E$6)","v":14},{"$f":"SLA(B11,$C$6,$D$6,$E$6)","v":0.86973267793655396},0.16726651787757874,{"$f":"Abandon(B11,$F$6,$D$6,$E$6)","v":0.10145226866006851},{"$f":"Utilisation(B11,$D$6,$E$6)","v":0.625},{"$f":"ASA(B11,$D$6,$E$6)","v":10},{"$f":"QueueTime(B11,$D$6,$E$6)","v":60},{"$f":"QueueSize(B11,$D$6,$E$6)","v":0}]
[null,{"$f":"B11+1","v":9},14,{"$f":"SLA(B12,$C$6,$D$6,$E$6)","v":0.94231182336807251},8.0510348081588745E-2,{"$f":"Abandon(B12,$F$6,$D$6,$E$6)","v":4.1335392743349075E-2},{"$f":"Utilisation(B12,$D$6,$E$6)","v":0.55555558204650879},{"$f":"ASA(B12,$D$6,$E$6)","v":4},{"$f":"QueueTime(B12,$D$6,$E$6)","v":45},{"$f":"QueueSize(B12,$D$6,$E$6)","v":0}]
[null,{"$f":"B12+1","v":10},14,0.97619789838790894,3.6105360835790634E-2,1.5691325068473816E-2,0.5,1,36,0]
[null,11,14,0.9908478856086731,1.5089299529790878E-2,5.5510429665446281E-3,0.45454546809196472,0,30,0]
[null,12,14,0.99671614170074463,5.8847139589488506E-3,1.8325188430026174E-3,0.4166666567325592,0,26,0]
{"$rows_left_out":21}